BDBM50191849 5-(3-chloro-4-fluorophenyl)-2-methoxy-4-(4-(4-methyl-1H-imidazol-5-yl)piperidin-1-yl)pyrimidine::CHEMBL385944
SMILES COc1ncc(-c2ccc(F)c(Cl)c2)c(n1)N1CCC(CC1)c1[nH]cnc1C
InChI Key InChIKey=UEOAEDYBCIOABB-UHFFFAOYSA-N
Data  1 IC50
  Tab Delimited (TSV)   2D SDfile   Computed 3D by Vconf -m prep SDfile
Find this compound or compounds like it in BindingDB:
Activity Spreadsheet -- Enzyme Inhibition Constant Data from BindingDB
Found 1 hit for monomerid = 50191849
TargetSodium/hydrogen exchanger 1(Homo sapiens (Human))
Pharmaceutical Research Institute
Curated by ChEMBL
LigandPNGBDBM50191849(5-(3-chloro-4-fluorophenyl)-2-methoxy-4-(4-(4-meth...)
Affinity DataIC50:  15nM. Assay description: Inhibition of human NHE1 expressed in Ap1 cell line
In DepthDetails ArticlePubMed