BDBM50191850 4-(4-(4-methyl-1H-imidazol-5-yl)piperidin-1-yl)-5-m-tolylpyrimidine::CHEMBL212033
SMILES Cc1nc[nH]c1C1CCN(CC1)c1ncncc1-c1cccc(C)c1
InChI Key InChIKey=RNYXPPQUXCPXMN-UHFFFAOYSA-N
Data  1 IC50
  Tab Delimited (TSV)   2D SDfile   Computed 3D by Vconf -m prep SDfile
Find this compound or compounds like it in BindingDB:
Activity Spreadsheet -- Enzyme Inhibition Constant Data from BindingDB
Found 1 hit for monomerid = 50191850
TargetSodium/hydrogen exchanger 1(Homo sapiens (Human))
Pharmaceutical Research Institute
Curated by ChEMBL
LigandPNGBDBM50191850(4-(4-(4-methyl-1H-imidazol-5-yl)piperidin-1-yl)-5-...)
Affinity DataIC50:  27nM. Assay description: Inhibition of human NHE1 expressed in Ap1 cell line
In DepthDetails ArticlePubMed