BDBM50192086 CHEMBL385050::cis-5-(4-hydroxybenzyl)-6-oxo-N-((S)-1-phenylethyl)morpholine-3-carboxamide
SMILES C[C@H](NC(=O)[C@@H]1COC(=O)[C@H](Cc2ccc(O)cc2)N1)c1ccccc1
InChI Key InChIKey=VTCVUCWUFOYVKZ-KKXDTOCCSA-N
Data  1 IC50
  Tab Delimited (TSV)   2D SDfile   Computed 3D by Vconf -m prep SDfile
Find this compound or compounds like it in BindingDB:
Activity Spreadsheet -- Enzyme Inhibition Constant Data from BindingDB
Found 1 hit for monomerid = 50192086
TargetVoltage-dependent T-type calcium channel subunit alpha-1G(Homo sapiens (Human))
Institute Of Science And Technology
Curated by ChEMBL
LigandPNGBDBM50192086(CHEMBL385050 | cis-5-(4-hydroxybenzyl)-6-oxo-N-((S...)
Affinity DataIC50:  1.39E+3nM. Assay description: Ability to block calcium channel T type 3.1v expressed in HEK293 cells by whole cell patch clamp method
In DepthDetails ArticlePubMed