BDBM50192592 CHEMBL218956::JWH-366::naphthalen-1-yl(1-pentyl-5-(pyridin-3-yl)-1H-pyrrol-3-yl)methanone
SMILES CCCCCn1cc(cc1-c1cccnc1)C(=O)c1cccc2ccccc12
InChI Key InChIKey=MPQYTRCOFXNOTB-UHFFFAOYSA-N
Data  2 KI
  Tab Delimited (TSV)   2D SDfile   Computed 3D by Vconf -m prep SDfile
Find this compound or compounds like it in BindingDB:
Activity Spreadsheet -- Enzyme Inhibition Constant Data from BindingDB
Found 2 hits for monomerid = 50192592
TargetCannabinoid receptor 2(Homo sapiens (Human))
Clemson University
Curated by ChEMBL
LigandPNGBDBM50192592(CHEMBL218956 | JWH-366 | naphthalen-1-yl(1-pentyl-...)
Affinity DataKi:  24nM. Assay description: Displacement of [3H]CP 55940 from human cloned CB2 receptor
In DepthDetails ArticlePubMed
TargetCannabinoid receptor 1(Rattus norvegicus (rat))
Clemson University
Curated by ChEMBL
LigandPNGBDBM50192592(CHEMBL218956 | JWH-366 | naphthalen-1-yl(1-pentyl-...)
Affinity DataKi:  191nM. Assay description: Displacement of [3H]CP 55940 from CB1 receptor in rat brain
In DepthDetails ArticlePubMed