BDBM50192597 (5-(2-butylphenyl)-1-pentyl-1H-pyrrol-3-yl)(naphthalen-1-yl)methanone::CHEMBL375802::JWH-373
SMILES CCCCCn1cc(cc1-c1ccccc1CCCC)C(=O)c1cccc2ccccc12
InChI Key InChIKey=LDGBUSJKRUNXPK-UHFFFAOYSA-N
Data  2 KI
  Tab Delimited (TSV)   2D SDfile   Computed 3D by Vconf -m prep SDfile
Find this compound or compounds like it in BindingDB:
Activity Spreadsheet -- Enzyme Inhibition Constant Data from BindingDB
Found 2 hits for monomerid = 50192597
TargetCannabinoid receptor 1(Rattus norvegicus (rat))
Clemson University
Curated by ChEMBL
LigandPNGBDBM50192597((5-(2-butylphenyl)-1-pentyl-1H-pyrrol-3-yl)(naphth...)
Affinity DataKi:  60nM. Assay description: Displacement of [3H]CP 55940 from CB1 receptor in rat brain
In DepthDetails ArticlePubMed
TargetCannabinoid receptor 2(Homo sapiens (Human))
Clemson University
Curated by ChEMBL
LigandPNGBDBM50192597((5-(2-butylphenyl)-1-pentyl-1H-pyrrol-3-yl)(naphth...)
Affinity DataKi:  69nM. Assay description: Displacement of [3H]CP 55940 from human cloned CB2 receptor
In DepthDetails ArticlePubMed