BDBM50193068 3-cyclopentyl-2-(furan-3-yl)-1-methyl-1H-indole-6,7-dicarboxylic acid::CHEMBL216032
SMILES Cn1c(-c2ccoc2)c(C2CCCC2)c2ccc(C(O)=O)c(C(O)=O)c12
InChI Key InChIKey=RFYDSALXXRYYFC-UHFFFAOYSA-N
Data  1 IC50
  Tab Delimited (TSV)   2D SDfile   Computed 3D by Vconf -m prep SDfile
Find this compound or compounds like it in BindingDB:
Activity Spreadsheet -- Enzyme Inhibition Constant Data from BindingDB
Found 1 hit for monomerid = 50193068
TargetRNA-directed RNA polymerase(Hepatitis C virus)
Boehringer Ingelheim Pharmaceuticals
Curated by ChEMBL
LigandPNGBDBM50193068(3-cyclopentyl-2-(furan-3-yl)-1-methyl-1H-indole-6,...)
Affinity DataIC50:  5.30E+3nM. Assay description: Inhibition of HCV 1b NS5B delta21 RNA dependent RNA polymerase by SPAChecked by Author
In DepthDetails ArticlePubMed