BDBM50193614 CHEMBL215955::N-(4-amino-2-propylquinolin-6-yl)-3-phenylpropanamide
SMILES CCCc1cc(N)c2cc(NC(=O)CCc3ccccc3)ccc2n1
InChI Key InChIKey=PUTFBYWJVTVHRL-UHFFFAOYSA-N
Data  1 IC50
  Tab Delimited (TSV)   2D SDfile   Computed 3D by Vconf -m prep SDfile
Find this compound or compounds like it in BindingDB:
Activity Spreadsheet -- Enzyme Inhibition Constant Data from BindingDB
Found 1 hit for monomerid = 50193614
TargetMelanin-concentrating hormone receptor 1(Homo sapiens (Human))
Merck Research Laboratories
Curated by ChEMBL
LigandPNGBDBM50193614(CHEMBL215955 | N-(4-amino-2-propylquinolin-6-yl)-3...)
Affinity DataIC50:  8.30E+3nM. Assay description: Displacement of 125I-[Phe13,Tyr19]-MCH from human MCH-R1
In DepthDetails ArticlePubMed