BDBM50193644 4-amino-2-propyl-N-(4-(trifluoromethyl)phenethyl)quinoline-6-carboxamide::CHEMBL217560
SMILES CCCc1cc(N)c2cc(ccc2n1)C(=O)NCCc1ccc(cc1)C(F)(F)F
InChI Key InChIKey=UGJFUFYWKAVXFZ-UHFFFAOYSA-N
Data  1 IC50
  Tab Delimited (TSV)   2D SDfile   Computed 3D by Vconf -m prep SDfile
Find this compound or compounds like it in BindingDB:
Activity Spreadsheet -- Enzyme Inhibition Constant Data from BindingDB
Found 1 hit for monomerid = 50193644
TargetMelanin-concentrating hormone receptor 1(Homo sapiens (Human))
Merck Research Laboratories
Curated by ChEMBL
LigandPNGBDBM50193644(4-amino-2-propyl-N-(4-(trifluoromethyl)phenethyl)q...)
Affinity DataIC50:  2.70E+3nM. Assay description: Displacement of 125I-[Phe13,Tyr19]-MCH from human MCH-R1
In DepthDetails ArticlePubMed