BDBM501937 US11028075, Example 70
SMILES Fc1cc(c(F)cc1O[C@H]1CC[C@@H](C[C@@H]1N1CCCC1)c1cccc(c1F)C(F)(F)F)S(=O)(=O)Nc1ccncn1
InChI Key InChIKey=NDHMDQVSDUZDON-SSKFGXFMSA-N
Data  2 IC50
  Tab Delimited (TSV)   2D SDfile   Computed 3D by Vconf -m prep SDfile
Find this compound or compounds like it in BindingDB:
Activity Spreadsheet -- Enzyme Inhibition Constant Data from BindingDB
Found 2 hits for monomerid = 501937
TargetSodium channel protein type 9 subunit alpha(Homo sapiens (Human))
Genentech
US Patent
LigandPNGBDBM501937(US11028075, Example 70)
Affinity DataIC50:  0.966nM. Assay description: The following voltage clamp electrophysiology studies are performed on representative compounds using cells heterologously expressing Nav1.7 or Nav1....
Ligand InfoPC cidPC sid
In DepthDetails US Patent
TargetSodium channel protein type 9 subunit alpha(Homo sapiens (Human))
Genentech
US Patent
LigandPNGBDBM501937(US11028075, Example 70)
Affinity DataIC50:  7.22nM. Assay description: Saturation experiments. A competitive NaV1.7 inhibitor having a methyl group is tritiated. Three tritiums are incorporated in place of methyl hydroge...
Ligand InfoPC cidPC sid
In DepthDetails US Patent