BDBM50193877 7-(2,6-dimethylphenyl)-N-(3-(2-ethoxy-4-methylpiperazin-1-yl)phenyl)-5-methylbenzo[e][1,2,4]triazin-3-amine::CHEMBL218386
SMILES CCOC1CN(C)CCN1c1cccc(Nc2nnc3cc(cc(C)c3n2)-c2c(C)cccc2C)c1
InChI Key InChIKey=MBXYRBTXYNKZPP-UHFFFAOYSA-N
Data  1 IC50
  Tab Delimited (TSV)   2D SDfile   Computed 3D by Vconf -m prep SDfile
Find this compound or compounds like it in BindingDB:
Activity Spreadsheet -- Enzyme Inhibition Constant Data from BindingDB
Found 1 hit for monomerid = 50193877
TargetProto-oncogene tyrosine-protein kinase Src(Homo sapiens (Human))
Targegen
Curated by ChEMBL
LigandPNGBDBM50193877(7-(2,6-dimethylphenyl)-N-(3-(2-ethoxy-4-methylpipe...)
Affinity DataIC50:  41nM. Assay description: Inhibition of human recombinant Src kinase
In DepthDetails ArticlePubMed