BDBM50193894 7-(2,6-dimethylphenyl)-5-methyl-N-(3-(4-methylpiperazin-1-ylsulfonyl)phenyl)benzo[e][1,2,4]triazin-3-amine::CHEMBL436516::US8481536, 408
SMILES CN1CCN(CC1)S(=O)(=O)c1cccc(Nc2nnc3cc(cc(C)c3n2)-c2c(C)cccc2C)c1
InChI Key InChIKey=CLYYVIUHRKFXFH-UHFFFAOYSA-N
Data  2 IC50
  Tab Delimited (TSV)   2D SDfile   Computed 3D by Vconf -m prep SDfile
Find this compound or compounds like it in BindingDB:
Activity Spreadsheet -- Enzyme Inhibition Constant Data from BindingDB
Found 2 hits for monomerid = 50193894
TargetProto-oncogene tyrosine-protein kinase Src(Homo sapiens (Human))
Targegen
Curated by ChEMBL
LigandPNGBDBM50193894(7-(2,6-dimethylphenyl)-5-methyl-N-(3-(4-methylpipe...)
Affinity DataIC50:  320nM. Assay description: Inhibition of human recombinant Src kinase
In DepthDetails ArticlePubMed
TargetProto-oncogene tyrosine-protein kinase Src(Homo sapiens (Human))
Targegen
Curated by ChEMBL
LigandPNGBDBM50193894(7-(2,6-dimethylphenyl)-5-methyl-N-(3-(4-methylpipe...)
Affinity DataIC50:  322nMT: 2°C. Assay description: Testing of inhibition of kinases in vitro using luciferase-based assay from KinaseGlo, Promega Corp.
In DepthDetails US Patent