BDBM50194176 5-amino-1-(5-O-trityl-beta-D-ribofuranosyl)imidazole-4-(N-propyl)carboxamide::CHEMBL386443
SMILES CCCNC(=O)c1ncn([C@@H]2O[C@H](COC(c3ccccc3)(c3ccccc3)c3ccccc3)[C@@H](O)[C@H]2O)c1N
InChI Key InChIKey=WDTCPECKAJIGNI-BQOYKFDPSA-N
Data  1 IC50
  Tab Delimited (TSV)   2D SDfile   Computed 3D by Vconf -m prep SDfile
Find this compound or compounds like it in BindingDB:
Activity Spreadsheet -- Enzyme Inhibition Constant Data from BindingDB
Found 1 hit for monomerid = 50194176
TargetThymidine phosphorylase(Homo sapiens (Human))
Instituto De QuíMica MéDica (Csic)
Curated by ChEMBL
LigandPNGBDBM50194176(5-amino-1-(5-O-trityl-beta-D-ribofuranosyl)imidazo...)
Affinity DataIC50:  1.30E+4nM. Assay description: Inhibition of human TPase in presence of 100 uM thymidine
In DepthDetails ArticlePubMed