BDBM50194316 (5R,2'S)-5-(1-methyl-2-pyrrolidinyl)oxazolidinone::(5R,2'S)-5[1'-methylpyrrolidin-2'-yl]-1,3-oxazolidin-2-one::CHEMBL220553
SMILES CN1CCC[C@H]1[C@H]1CNC(=O)O1
InChI Key InChIKey=CRTBVFNYYUEWDJ-NKWVEPMBSA-N
Data  3 KI
  Tab Delimited (TSV)   2D SDfile   Computed 3D by Vconf -m prep SDfile
Find this compound or compounds like it in BindingDB:
Activity Spreadsheet -- Enzyme Inhibition Constant Data from BindingDB
Found 3 hits for monomerid = 50194316
TargetNeuronal acetylcholine receptor subunit alpha-4(Rattus norvegicus (Rat))
Università
Curated by ChEMBL
LigandPNGBDBM50194316((5R,2'S)-5-(1-methyl-2-pyrrolidinyl)oxazolidinone ...)
Affinity DataKi:  3.50E+4nM. Assay description: Displacement of [3H]epibatidine from alpha4beta2 nAchR in rat brain cortex membrane
In DepthDetails ArticlePubMed
TargetNeuronal acetylcholine receptor subunit alpha-7(Rattus norvegicus (Rat))
Università
Curated by ChEMBL
LigandPNGBDBM50194316((5R,2'S)-5-(1-methyl-2-pyrrolidinyl)oxazolidinone ...)
Affinity DataKi:  1.00E+5nM. Assay description: Displacement of [125I]alphaBungarotoxin from alpha7 nAchR in rat brain cortex membrane
In DepthDetails ArticlePubMed
TargetNeuronal acetylcholine receptor subunit alpha-7(Rattus norvegicus (Rat))
Università
Curated by ChEMBL
LigandPNGBDBM50194316((5R,2'S)-5-(1-methyl-2-pyrrolidinyl)oxazolidinone ...)
Affinity DataKi:  1.17E+5nM. Assay description: Displacement of [3H]alpha-Bungarotoxin from alpha-7 nAChR in rat brain cortex membranes
In DepthDetails ArticlePubMed