BDBM50194408 ((2S,4aR,6aS,7R,9S,10aS,10bR)-9-acetoxy-2-(furan-3-yl)-6a,10b-dimethyl-4,10-dioxo-dodecahydro-1H-benzo[f]isochromen-7-yl)methyl 4-methylbenzoate::CHEMBL220712
SMILES CC(=O)O[C@H]1C[C@@H](COC(=O)c2ccc(C)cc2)[C@]2(C)CC[C@H]3C(=O)O[C@@H](C[C@]3(C)[C@H]2C1=O)c1ccoc1
InChI Key InChIKey=BKDQLXDEOLDHHY-KLKKBBNASA-N
Data  1 KI
  Tab Delimited (TSV)   2D SDfile   Computed 3D by Vconf -m prep SDfile
Find this compound or compounds like it in BindingDB:
Activity Spreadsheet -- Enzyme Inhibition Constant Data from BindingDB
Found 1 hit for monomerid = 50194408
TargetKappa-type opioid receptor(Homo sapiens (Human))
Harvard Medical School
Curated by ChEMBL
LigandPNGBDBM50194408(((2S,4aR,6aS,7R,9S,10aS,10bR)-9-acetoxy-2-(furan-3...)
Affinity DataKi: >1.00E+3nM. Assay description: Displacement of [3H]diprenorphine binding from human kappa opioid receptor expressed in CHO cells
In DepthDetails ArticlePubMed