BDBM50194517 CHEMBL385737::methyl 3-(3-cyanophenyl)-5-(diisopropylamino)-5-oxo-4-(pyridin-3-yl)pentanoate
SMILES COC(=O)CC(C(C(=O)N(C(C)C)C(C)C)c1cccnc1)c1cccc(c1)C#N
InChI Key InChIKey=AQYXCHXDURJJSL-UHFFFAOYSA-N
Data  1 IC50
  Tab Delimited (TSV)   2D SDfile   Computed 3D by Vconf -m prep SDfile
Find this compound or compounds like it in BindingDB:
Activity Spreadsheet -- Enzyme Inhibition Constant Data from BindingDB
Found 1 hit for monomerid = 50194517
TargetPotassium voltage-gated channel subfamily A member 5(Homo sapiens (Human))
Merck Research Laboratories
Curated by ChEMBL
LigandPNGBDBM50194517(CHEMBL385737 | methyl 3-(3-cyanophenyl)-5-(diisopr...)
Affinity DataIC50:  184nM. Assay description: Inhibition of Kv1.5
In DepthDetails ArticlePubMed