BDBM50194520 CHEMBL385920::N1,N1-diisopropyl-3-phenyl-N5-((4-phenylmorpholin-2-yl)methyl)-2-(pyridin-3-yl)pentanediamide
SMILES CC(C)N(C(C)C)C(=O)C(C(CC(=O)NCC1CN(CCO1)c1ccccc1)c1ccccc1)c1cccnc1
InChI Key InChIKey=UNKIWQQIPSHWKG-UHFFFAOYSA-N
Data  1 IC50
  Tab Delimited (TSV)   2D SDfile   Computed 3D by Vconf -m prep SDfile
Find this compound or compounds like it in BindingDB:
Activity Spreadsheet -- Enzyme Inhibition Constant Data from BindingDB
Found 1 hit for monomerid = 50194520
TargetPotassium voltage-gated channel subfamily A member 5(Homo sapiens (Human))
Merck Research Laboratories
Curated by ChEMBL
LigandPNGBDBM50194520(CHEMBL385920 | N1,N1-diisopropyl-3-phenyl-N5-((4-p...)
Affinity DataIC50:  3.38E+3nM. Assay description: Inhibition of Kv1.5
In DepthDetails ArticlePubMed