BDBM50194527 4-(3-(2-fluorobenzyl)ureido)-N,N-diisopropyl-3-phenyl-2-(pyridin-3-yl)butanamide::CHEMBL217620
SMILES CC(C)N(C(C)C)C(=O)C(C(CNC(=O)NCc1ccccc1F)c1ccccc1)c1cccnc1
InChI Key InChIKey=QETZKUXEQXKZMN-UHFFFAOYSA-N
Data  1 IC50
  Tab Delimited (TSV)   2D SDfile   Computed 3D by Vconf -m prep SDfile
Find this compound or compounds like it in BindingDB:
Activity Spreadsheet -- Enzyme Inhibition Constant Data from BindingDB
Found 1 hit for monomerid = 50194527
TargetPotassium voltage-gated channel subfamily A member 5(Homo sapiens (Human))
Merck Research Laboratories
Curated by ChEMBL
LigandPNGBDBM50194527(4-(3-(2-fluorobenzyl)ureido)-N,N-diisopropyl-3-phe...)
Affinity DataIC50:  150nM. Assay description: Inhibition of Kv1.5
In DepthDetails ArticlePubMed