BDBM50194529 CHEMBL216254::N,N-diisopropyl-3-phenyl-4-(3-((S)-1-phenylethyl)ureido)-2-(pyridin-3-yl)butanamide
SMILES CC(C)N(C(C)C)C(=O)C(C(CNC(=O)N[C@@H](C)c1ccccc1)c1ccccc1)c1cccnc1
InChI Key InChIKey=LAZKKOQEAVOWIR-GHXQVECXSA-N
Data  1 IC50
  Tab Delimited (TSV)   2D SDfile   Computed 3D by Vconf -m prep SDfile
Find this compound or compounds like it in BindingDB:
Activity Spreadsheet -- Enzyme Inhibition Constant Data from BindingDB
Found 1 hit for monomerid = 50194529
TargetPotassium voltage-gated channel subfamily A member 5(Homo sapiens (Human))
Merck Research Laboratories
Curated by ChEMBL
LigandPNGBDBM50194529(CHEMBL216254 | N,N-diisopropyl-3-phenyl-4-(3-((S)-...)
Affinity DataIC50:  490nM. Assay description: Inhibition of Kv1.5
In DepthDetails ArticlePubMed