BDBM50194534 CHEMBL216338::N5-(2-(tert-butylthio)ethyl)-N1,N1-diisopropyl-3-phenyl-2-(pyridin-3-yl)pentanediamide
SMILES CC(C)N(C(C)C)C(=O)C(C(CC(=O)NCCSC(C)(C)C)c1ccccc1)c1cccnc1
InChI Key InChIKey=WENRLSGTPKHYKG-UHFFFAOYSA-N
Data  1 IC50
  Tab Delimited (TSV)   2D SDfile   Computed 3D by Vconf -m prep SDfile
Find this compound or compounds like it in BindingDB:
Activity Spreadsheet -- Enzyme Inhibition Constant Data from BindingDB
Found 1 hit for monomerid = 50194534
TargetPotassium voltage-gated channel subfamily A member 5(Homo sapiens (Human))
Merck Research Laboratories
Curated by ChEMBL
LigandPNGBDBM50194534(CHEMBL216338 | N5-(2-(tert-butylthio)ethyl)-N1,N1-...)
Affinity DataIC50:  1.59E+3nM. Assay description: Inhibition of Kv1.5
In DepthDetails ArticlePubMed