BDBM50195746 CHEMBL227546::ethyl 3-phenoxybenzyl butylphosphonate
SMILES CCCCP(=O)(OCC)OCc1ccccc1Oc1ccccc1
InChI Key InChIKey=ZJDHCXPMUVBUIV-UHFFFAOYSA-N
Data  1 IC50
  Tab Delimited (TSV)   2D SDfile   Computed 3D by Vconf -m prep SDfile
Find this compound or compounds like it in BindingDB:
Activity Spreadsheet -- Enzyme Inhibition Constant Data from BindingDB
Found 1 hit for monomerid = 50195746
TargetDiacylglycerol acyltransferase/mycolyltransferase Ag85C(Mycobacterium tuberculosis)
University Of Ljubljana
Curated by ChEMBL
LigandPNGBDBM50195746(CHEMBL227546 | ethyl 3-phenoxybenzyl butylphosphon...)
Affinity DataIC50:  2.00E+3nM. Assay description: Inhibition of Mycobacterium tuberculosis recombinant antigen 85C mycolyltransferase
In DepthDetails ArticlePubMed