BDBM50195827 ({[({[(2R,3S,4R,5R)-3,4-dihydroxy-5-(1-oxo-1,2,5,6,7,8-hexahydroisoquinolin-2-yl)oxolan-2-yl]methoxy}(hydroxy)phosphoryl)oxy](hydroxy)phosphoryl}oxy)phosphonic acid::CHEMBL239814
SMILES O[C@H]1[C@@H](O)[C@@H](O[C@@H]1COP(O)(=O)OP(O)(=O)OP(O)(O)=O)n1ccc2CCCCc2c1=O
InChI Key InChIKey=BXYVFXVHWLQNDH-HKUMRIAESA-N
Data  1 EC50
  Tab Delimited (TSV)   2D SDfile   Computed 3D by Vconf -m prep SDfile
Find this compound or compounds like it in BindingDB:
Activity Spreadsheet -- Enzyme Inhibition Constant Data from BindingDB
Found 1 hit for monomerid = 50195827
TargetP2Y purinoceptor 2(Homo sapiens (Human))
Ucb-Group
Curated by ChEMBL
LigandPNGBDBM50195827(({[({[(2R,3S,4R,5R)-3,4-dihydroxy-5-(1-oxo-1,2,5,6...)
Affinity DataEC50:  55nM. Assay description: Agonist activity at human P2Y2 receptor expressed in human 1321N1 by FLIPR assay
In DepthDetails ArticlePubMed