BDBM50196127 (R)-{4-[4-(3,4-dimethylpiperazin-1-yl)phenylamino]-6-fluoroquinolin-3-yl}methanol::CHEMBL214661
SMILES C[C@@H]1CN(CCN1C)c1ccc(Nc2c(CO)cnc3ccc(F)cc23)cc1
InChI Key InChIKey=RLNXYUWOYNTOTQ-OAHLLOKOSA-N
Data  4 KI
  Tab Delimited (TSV)   2D SDfile   Computed 3D by Vconf -m prep SDfile
Find this compound or compounds like it in BindingDB:
Activity Spreadsheet -- Enzyme Inhibition Constant Data from BindingDB
Found 4 hits for monomerid = 50196127
TargetAlpha-2C adrenergic receptor(Homo sapiens (Human))
Juvantia Pharma
Curated by ChEMBL
LigandPNGBDBM50196127((R)-{4-[4-(3,4-dimethylpiperazin-1-yl)phenylamino]...)
Affinity DataKi:  38nM. Assay description: Displacement of [3H]rauwolscine from human ADRA2C expressed in S115 cells
In DepthDetails ArticlePubMed
TargetAlpha-2C adrenergic receptor(Homo sapiens (Human))
Juvantia Pharma
Curated by ChEMBL
LigandPNGBDBM50196127((R)-{4-[4-(3,4-dimethylpiperazin-1-yl)phenylamino]...)
Affinity DataKi:  38.0nM. Assay description: Binding affinity to human cloned Alpha-2C adrenergic receptor
In DepthDetails ArticlePubMed
TargetAlpha-2A adrenergic receptor(Homo sapiens (Human))
Juvantia Pharma
Curated by ChEMBL
LigandPNGBDBM50196127((R)-{4-[4-(3,4-dimethylpiperazin-1-yl)phenylamino]...)
Affinity DataKi:  980nM. Assay description: Displacement of [3H]rauwolscine from human ADRA2A expressed in S115 cells
In DepthDetails ArticlePubMed
TargetAlpha-2B adrenergic receptor(Homo sapiens (Human))
Juvantia Pharma
Curated by ChEMBL
LigandPNGBDBM50196127((R)-{4-[4-(3,4-dimethylpiperazin-1-yl)phenylamino]...)
Affinity DataKi:  3.15E+3nM. Assay description: Displacement of [3H]rauwolscine from human ADRA2B expressed in S115 cells
In DepthDetails ArticlePubMed