BDBM501964 US11028080, No. 15
SMILES CCNc1nc(Nc2cn(Cc3ccn(C)n3)c(C#N)c2C)ncc1C(F)(F)F
InChI Key InChIKey=GMSFABYNSMBXMS-UHFFFAOYSA-N
Data  1 IC50
  Tab Delimited (TSV)   2D SDfile   Computed 3D by Vconf -m prep SDfile
Find this compound or compounds like it in BindingDB:
Activity Spreadsheet -- Enzyme Inhibition Constant Data from BindingDB
Found 1 hit for monomerid = 501964
TargetLeucine-rich repeat serine/threonine-protein kinase 2 [G2019S](Homo sapiens (Human))
Denali Therapeutics
US Patent
LigandPNGBDBM501964(US11028080, No. 15)
Affinity DataIC50: <30nM. Assay description: Materials:LRRK2 G2019S enzymeSubstrate (LRRKtide)ATPTR-FRET dilution bufferpLRRKtide antibody384-well assay plateDMSOEnzyme reaction conditions50 mM ...
Ligand InfoPC cidPC sid
In DepthDetails US Patent