BDBM50196558 1-(6-(p-toluidino)-9-((2R,3R,4S,5R)-3,4-dihydroxy-5-(hydroxymethyl)-tetrahydrofuran-2-yl)-9H-purin-2-yl)-N-ethyl-1H-pyrazole-4-carboxamide::CHEMBL232512
SMILES CCNC(=O)c1cnn(c1)-c1nc(Nc2ccc(C)cc2)c2ncn([C@@H]3O[C@H](CO)[C@@H](O)[C@H]3O)c2n1
InChI Key InChIKey=LYQNYMHCYLJLJU-UVLLPENVSA-N
Data  4 KI
  Tab Delimited (TSV)   2D SDfile   Computed 3D by Vconf -m prep SDfile
Find this compound or compounds like it in BindingDB:
Activity Spreadsheet -- Enzyme Inhibition Constant Data from BindingDB
Found 4 hits for monomerid = 50196558
TargetAdenosine receptor A3(Homo sapiens (Human))
Cv Therapeutics
Curated by ChEMBL
LigandPNGBDBM50196558(1-(6-(p-toluidino)-9-((2R,3R,4S,5R)-3,4-dihydroxy-...)
Affinity DataKi:  0.700nM. Assay description: Displacement of [125I]ABMECA from adenosine A3 receptor expressed in CHO cells
In DepthDetails ArticlePubMed
TargetAdenosine receptor A1(Homo sapiens (Human))
Cv Therapeutics
Curated by ChEMBL
LigandPNGBDBM50196558(1-(6-(p-toluidino)-9-((2R,3R,4S,5R)-3,4-dihydroxy-...)
Affinity DataKi:  121nM. Assay description: Displacement of [3H]CPX from adenosine A1 receptor in DDT membranes
In DepthDetails ArticlePubMed
TargetAdenosine receptor A2a(Homo sapiens (Human))
Cv Therapeutics
Curated by ChEMBL
LigandPNGBDBM50196558(1-(6-(p-toluidino)-9-((2R,3R,4S,5R)-3,4-dihydroxy-...)
Affinity DataKi: >5.00E+3nM. Assay description: Displacement of [3H]ZM241385 from A2A adenosine A2A receptor expressed in HEK cells
In DepthDetails ArticlePubMed
TargetAdenosine receptor A2b(Homo sapiens (Human))
Cv Therapeutics
Curated by ChEMBL
LigandPNGBDBM50196558(1-(6-(p-toluidino)-9-((2R,3R,4S,5R)-3,4-dihydroxy-...)
Affinity DataKi: >6.00E+3nM. Assay description: Displacement of [3H]ZM241385 from adenosine A2B receptor expressed in HEK cells
In DepthDetails ArticlePubMed