BDBM50197289 CHEMBL3970733
SMILES O=C(NCc1ccc-2c(Cc3ccccc-23)c1)c1ccc(cc1)-c1ccccc1
InChI Key InChIKey=JLYUMHPSBGZNRP-UHFFFAOYSA-N
Data  1 IC50
  Tab Delimited (TSV)   2D SDfile   Computed 3D by Vconf -m prep SDfile
Find this compound or compounds like it in BindingDB:
Activity Spreadsheet -- Enzyme Inhibition Constant Data from BindingDB
Found 1 hit for monomerid = 50197289
TargetProtein-serine O-palmitoleoyltransferase porcupine(Mus musculus)
Soochow University
Curated by ChEMBL
LigandPNGBDBM50197289(CHEMBL3970733)
Affinity DataIC50: >1.00E+3nM. Assay description: Inhibition of porcupine in mouse L Wnt3A cells co-cultured with HEK293 cells after 48 hrs by Super-top flash reporter gene assay
In DepthDetails ArticlePubMed