BDBM50197300 CHEMBL3912164::ebselen derivative 2e
SMILES COc1ccccc1NC(=O)c1ccccc1[Se][Se]c1ccccc1C(=O)Nc1ccccc1OC
InChI Key InChIKey=WNFPBFJRJMQTGX-UHFFFAOYSA-N
Data  4 IC50
  Tab Delimited (TSV)   2D SDfile   Computed 3D by Vconf -m prep SDfile
Find this compound or compounds like it in BindingDB:
Activity Spreadsheet -- Enzyme Inhibition Constant Data from BindingDB
Found 4 hits for monomerid = 50197300
TargetMicrotubule-associated protein 2(Homo sapiens (Human))
Wroclaw University Of Technology
Curated by ChEMBL
LigandPNGBDBM50197300(CHEMBL3912164 | ebselen derivative 2e)
Affinity DataIC50:  6.79E+3nM. Assay description: Non-covalent/mixed type inhibition of recombinant human MetAP2 using Met-AMC as substrate preincubated for 30 mins followed by substrate addition by ...
In DepthDetails ArticlePubMed
TargetReplicase polyprotein 1ab(2019-nCoV)
The State University Of New Jersey
Curated by ChEMBL
LigandPNGBDBM50197300(CHEMBL3912164 | ebselen derivative 2e)
Affinity DataIC50:  263nM. Assay description: Inhibition of SARS-CoV-2 papain-like protease preincubated for 60 mins
In DepthDetails ArticlePubMed
TargetReplicase polyprotein 1ab(2019-nCoV)
The State University Of New Jersey
Curated by ChEMBL
LigandPNGBDBM50197300(CHEMBL3912164 | ebselen derivative 2e)
Affinity DataIC50:  260nM. Assay description: Inhibition of recombinant SARS CoV-2 PL protease incubated for 60 mins by fluorescence based analysis
In DepthDetails PubMed
TargetReplicase polyprotein 1ab(2019-nCoV)
The State University Of New Jersey
Curated by ChEMBL
LigandPNGBDBM50197300(CHEMBL3912164 | ebselen derivative 2e)
Affinity DataIC50:  263nM. Assay description: The inhibitor was screened against recombinant PL​pro​SARS and PL​pro​CoV2 at 37°Cin the assay buffer as described above. For...
In DepthDetails