BDBM50197695 ({[({[(2R,3S,4R,5R)-5-(5-fluoro-1,3-benzothiazol-2-yl)-3,4-dihydroxyoxolan-2-yl]methoxy}(hydroxy)phosphoryl)oxy](hydroxy)phosphoryl}oxy)phosphonic acid::CHEMBL241483
SMILES O[C@@H]1[C@@H](COP(O)(=O)OP(O)(=O)OP(O)(O)=O)O[C@H]([C@@H]1O)c1nc2cc(F)ccc2s1
InChI Key InChIKey=HUUIYKRAUZLBPZ-QCNRFFRDSA-N
Data  1 EC50
  Tab Delimited (TSV)   2D SDfile   Computed 3D by Vconf -m prep SDfile
Find this compound or compounds like it in BindingDB:
Activity Spreadsheet -- Enzyme Inhibition Constant Data from BindingDB
Found 1 hit for monomerid = 50197695
TargetP2Y purinoceptor 2(Homo sapiens (Human))
Ucb-Group
Curated by ChEMBL
LigandPNGBDBM50197695(({[({[(2R,3S,4R,5R)-5-(5-fluoro-1,3-benzothiazol-2...)
Affinity DataEC50:  3nM. Assay description: Agonist activity at human P2Y2 receptor expressed in human 1321N1 by FLIPR assay
In DepthDetails ArticlePubMed