BDBM50197848 3-(4-tridecyl-2,5-dioxo-2,5-dihydrofuran-3-yl)propanoicacid::CHEMBL228410
SMILES CCCCCCCCCCCCCC1=C(CCC(O)=O)C(=O)OC1=O
InChI Key InChIKey=KAEZUCMIGJWRNA-UHFFFAOYSA-N
Data  3 IC50
  Tab Delimited (TSV)   2D SDfile   Computed 3D by Vconf -m prep SDfile
Find this compound or compounds like it in BindingDB:
Activity Spreadsheet -- Enzyme Inhibition Constant Data from BindingDB
Found 3 hits for monomerid = 50197848
TargetM-phase inducer phosphatase 3(Homo sapiens (Human))
Université
Curated by ChEMBL
LigandPNGBDBM50197848(3-(4-tridecyl-2,5-dioxo-2,5-dihydrofuran-3-yl)prop...)
Affinity DataIC50:  5.70E+3nM. Assay description: Inhibition of human GST-Cdc25C expressed in Escherichia coli BL21(DE3)
In DepthDetails ArticlePubMed
TargetM-phase inducer phosphatase 1(Homo sapiens (Human))
Université
Curated by ChEMBL
LigandPNGBDBM50197848(3-(4-tridecyl-2,5-dioxo-2,5-dihydrofuran-3-yl)prop...)
Affinity DataIC50:  8.10E+3nM. Assay description: Inhibition of human GST-Cdc25A expressed in Escherichia coli BL21(DE3)
In DepthDetails ArticlePubMed
TargetM-phase inducer phosphatase 2(Homo sapiens (Human))
Université
Curated by ChEMBL
LigandPNGBDBM50197848(3-(4-tridecyl-2,5-dioxo-2,5-dihydrofuran-3-yl)prop...)
Affinity DataIC50:  8.70E+3nM. Assay description: Inhibition of human GST-Cdc25B expressed in Escherichia coli BL21(DE3)
In DepthDetails ArticlePubMed