BDBM50198600 7-(3-(3,3-difluoropyrrolidin-1-yl)propoxy)-4-(4-methoxyphenyl)-2-methyl-1,2,3,4-tetrahydroisoquinoline::CHEMBL234732
SMILES COc1ccc(cc1)C1CN(C)Cc2cc(OCCCN3CCC(F)(F)C3)ccc12
InChI Key InChIKey=PMTYUERLXGUADP-UHFFFAOYSA-N
Data  3 KI
  Tab Delimited (TSV)   2D SDfile   Computed 3D by Vconf -m prep SDfile
Find this compound or compounds like it in BindingDB:
Activity Spreadsheet -- Enzyme Inhibition Constant Data from BindingDB
Found 3 hits for monomerid = 50198600
TargetSodium-dependent serotonin transporter(Homo sapiens (Human))
Johnson & Johnson Pharmaceutical Research And Development
Curated by ChEMBL
LigandPNGBDBM50198600(7-(3-(3,3-difluoropyrrolidin-1-yl)propoxy)-4-(4-me...)
Affinity DataKi:  7.30nM. Assay description: Binding affinity to human SERT
In DepthDetails ArticlePubMed
TargetSodium-dependent serotonin transporter(Rattus norvegicus (rat))
Johnson & Johnson Pharmaceutical Research And Development
Curated by ChEMBL
LigandPNGBDBM50198600(7-(3-(3,3-difluoropyrrolidin-1-yl)propoxy)-4-(4-me...)
Affinity DataKi:  8nM. Assay description: Binding affinity to rat SERT
In DepthDetails ArticlePubMed
TargetHistamine H3 receptor(Homo sapiens (Human))
Johnson & Johnson Pharmaceutical Research And Development
Curated by ChEMBL
LigandPNGBDBM50198600(7-(3-(3,3-difluoropyrrolidin-1-yl)propoxy)-4-(4-me...)
Affinity DataKi:  9.5nM. Assay description: Binding affinity to human histamine H3 receptor
In DepthDetails ArticlePubMed