BDBM50199202 6-(4-chlorophenyl)-3-[2-(1-piperidinylmethyl)-6-quinolinyl]-thieno[3,2-d]pyrimidin-4(3H)-one::CHEMBL386349
SMILES Clc1ccc(cc1)-c1cc2ncn(-c3ccc4nc(CN5CCCCC5)ccc4c3)c(=O)c2s1
InChI Key InChIKey=UUZGQDHCPMCNHE-UHFFFAOYSA-N
Data  1 IC50
  Tab Delimited (TSV)   2D SDfile   Computed 3D by Vconf -m prep SDfile
Find this compound or compounds like it in BindingDB:
Activity Spreadsheet -- Enzyme Inhibition Constant Data from BindingDB
Found 1 hit for monomerid = 50199202
TargetMelanin-concentrating hormone receptor 1(Homo sapiens (Human))
Glaxosmithkline
Curated by ChEMBL
LigandPNGBDBM50199202(6-(4-chlorophenyl)-3-[2-(1-piperidinylmethyl)-6-qu...)
Affinity DataIC50:  0.890nM. Assay description: Antagonist activity against human MCHR1 expressed in CHO cells by Gal4/Elk1-Luc reporter assay
In DepthDetails ArticlePubMed