BDBM50199205 6-(4-chlorophenyl)-3-{2-[(dimethylamino)methyl]-6-quinolinyl}thieno[3,2-d]pyrimidin-4(3H)-one::CHEMBL217269
SMILES CN(C)Cc1ccc2cc(ccc2n1)-n1cnc2cc(sc2c1=O)-c1ccc(Cl)cc1
InChI Key InChIKey=RAXCDNRFFLXBJM-UHFFFAOYSA-N
Data  1 IC50
  Tab Delimited (TSV)   2D SDfile   Computed 3D by Vconf -m prep SDfile
Find this compound or compounds like it in BindingDB:
Activity Spreadsheet -- Enzyme Inhibition Constant Data from BindingDB
Found 1 hit for monomerid = 50199205
TargetMelanin-concentrating hormone receptor 1(Homo sapiens (Human))
Glaxosmithkline
Curated by ChEMBL
LigandPNGBDBM50199205(6-(4-chlorophenyl)-3-{2-[(dimethylamino)methyl]-6-...)
Affinity DataIC50:  0.740nM. Assay description: Antagonist activity against human MCHR1 expressed in CHO cells by Gal4/Elk1-Luc reporter assay
In DepthDetails ArticlePubMed