BDBM50199297 (S)-4-(8-ethyl-5-oxo-4-propyl-4,5,7,8-tetrahydro-1H-imidazo[1,2-g]purin-2-yl)bicyclo[2.2.2]octane-1-carboxylic acid::CHEMBL217027
SMILES CCCn1c2nc(nc2c2N[C@@H](CC)Cn2c1=O)C12CCC(CC1)(CC2)C(O)=O
InChI Key InChIKey=ICGYLUFLIGIQPB-GQKRIFGNSA-N
Data  1 KI
  Tab Delimited (TSV)   2D SDfile   Computed 3D by Vconf -m prep SDfile
Find this compound or compounds like it in BindingDB:
Activity Spreadsheet -- Enzyme Inhibition Constant Data from BindingDB
Found 1 hit for monomerid = 50199297
TargetAdenosine receptor A1(Rattus norvegicus (rat))
Biogen Idec
Curated by ChEMBL
LigandPNGBDBM50199297((S)-4-(8-ethyl-5-oxo-4-propyl-4,5,7,8-tetrahydro-1...)
Affinity DataKi: >250nM. Assay description: Displacement of [3H]DPCPX from adenosine A1 receptor in rat cerebral cortex
In DepthDetails ArticlePubMed