BDBM50199459 CHEMBL3905850
SMILES [H][C@]12C[C@@]1(CO)[C@@H](O)[C@@H](O)[C@@H]2n1cnc2c(N[C@H](C(C)C)C3CC3)nc(Cl)nc12
InChI Key InChIKey=PSZUVLHNNPZVCD-XRPRFISDSA-N
Data  6 KI
  Tab Delimited (TSV)   2D SDfile   Computed 3D by Vconf -m prep SDfile
Find this compound or compounds like it in BindingDB:
Activity Spreadsheet -- Enzyme Inhibition Constant Data from BindingDB
Found 6 hits for monomerid = 50199459
TargetAdenosine receptor A1(Homo sapiens (Human))
National Institute Of Diabetes And Digestive And Kidney Diseases
Curated by ChEMBL
LigandPNGBDBM50199459(CHEMBL3905850)
Affinity DataKi:  103nM. Assay description: Displacement of [3H]N6-phenylisopropyladenosine from recombinant human A1AR expressed in CHO cell membranes after 60 mins by liquid scintillation cou...
In DepthDetails ArticlePubMed
Target5-hydroxytryptamine receptor 2B(Homo sapiens (Human))
National Institute Of Diabetes And Digestive And Kidney Diseases
Curated by ChEMBL
LigandPNGBDBM50199459(CHEMBL3905850)
Affinity DataKi:  163nM. Assay description: Displacement of [3H]lysergic from human 5-HT2BR expressed in HEK cell membranes incubated in dark for 90 mins by microbeta scintillation counting met...
In DepthDetails ArticlePubMed
Target5-hydroxytryptamine receptor 2C(Homo sapiens (Human))
National Institute Of Diabetes And Digestive And Kidney Diseases
Curated by ChEMBL
LigandPNGBDBM50199459(CHEMBL3905850)
Affinity DataKi:  190nM. Assay description: Displacement of [3H]mesulergine from human 5-HT2CR expressed in Flp-In HEK cell membranes incubated for 90 mins under dark condition by microbeta sci...
In DepthDetails ArticlePubMed
TargetTransmembrane domain-containing protein TMIGD3(Homo sapiens (Human))
National Institute Of Diabetes And Digestive And Kidney Diseases
Curated by ChEMBL
LigandPNGBDBM50199459(CHEMBL3905850)
Affinity DataKi:  1.24E+3nM. Assay description: Displacement of [125l]N 6-(4-amino-3-iodobenzyl)adenosine-5'-N-methyluronamide from recombinant human A3AR expressed in CHO cell membranes after 60 m...
In DepthDetails ArticlePubMed
TargetAdenosine receptor A2a(Homo sapiens (Human))
National Institute Of Diabetes And Digestive And Kidney Diseases
Curated by ChEMBL
LigandPNGBDBM50199459(CHEMBL3905850)
Affinity DataKi:  2.20E+3nM. Assay description: Displacement of [3 H]2-[p-(2-carboxyethyl)phenyl-ethylamino]-5'-N-ethylcarboxamidoadenosine from recombinant human adenosine receptor A2A expressed i...
In DepthDetails ArticlePubMed
Target5-hydroxytryptamine receptor 2A(Homo sapiens (Human))
National Institute Of Diabetes And Digestive And Kidney Diseases
Curated by ChEMBL
LigandPNGBDBM50199459(CHEMBL3905850)
Affinity DataKi: >1.00E+4nM. Assay description: Displacement of [3H]ketanserin from human 5-HT2A receptor expressed in HEK-T cell membranes incubated for 90 mins under dark condition by microbeta s...
In DepthDetails ArticlePubMed