BDBM501997 US11028080, No. 53::US11028080, No. 54
SMILES COc1nc(Nc2sc(nc2C2CC2)C2(C)CCNC2=O)ncc1Br
InChI Key InChIKey=OQMKCMWLSCRSFQ-UHFFFAOYSA-N
Data  2 IC50
  Tab Delimited (TSV)   2D SDfile   Computed 3D by Vconf -m prep SDfile
Find this compound or compounds like it in BindingDB:
Activity Spreadsheet -- Enzyme Inhibition Constant Data from BindingDB
Found 2 hits for monomerid = 501997
TargetLeucine-rich repeat serine/threonine-protein kinase 2 [G2019S](Homo sapiens (Human))
Denali Therapeutics
US Patent
LigandPNGBDBM501997(US11028080, No. 53 | US11028080, No. 54)
Affinity DataIC50: <30nM. Assay description: Materials:LRRK2 G2019S enzymeSubstrate (LRRKtide)ATPTR-FRET dilution bufferpLRRKtide antibody384-well assay plateDMSOEnzyme reaction conditions50 mM ...
Ligand InfoPC cidPC sid
In DepthDetails US Patent
TargetLeucine-rich repeat serine/threonine-protein kinase 2 [G2019S](Homo sapiens (Human))
Denali Therapeutics
US Patent
LigandPNGBDBM501997(US11028080, No. 53 | US11028080, No. 54)
Affinity DataIC50: <30nM. Assay description: Materials:LRRK2 G2019S enzymeSubstrate (LRRKtide)ATPTR-FRET dilution bufferpLRRKtide antibody384-well assay plateDMSOEnzyme reaction conditions50 mM ...
Ligand InfoPC cidPC sid
In DepthDetails US Patent