BDBM50199774 3-{4-[(R)-3-(5-ethyl-biphenyl-2-yloxy)-butoxy]-2-methyl-phenyl}-propionic acid::CHEMBL393926
SMILES CCc1ccc(O[C@H](C)CCOc2ccc(CCC(O)=O)c(C)c2)c(c1)-c1ccccc1
InChI Key InChIKey=XWNWLWRJRXDQCE-OAQYLSRUSA-N
Data  2 IC50  3 EC50
  Tab Delimited (TSV)   2D SDfile   Computed 3D by Vconf -m prep SDfile
Find this compound or compounds like it in BindingDB:
Activity Spreadsheet -- Enzyme Inhibition Constant Data from BindingDB
Found 5 hits for monomerid = 50199774
TargetPeroxisome proliferator-activated receptor alpha(Homo sapiens (Human))
Eli Lilly
Curated by ChEMBL
LigandPNGBDBM50199774(3-{4-[(R)-3-(5-ethyl-biphenyl-2-yloxy)-butoxy]-2-m...)
Affinity DataEC50:  2.88E+3nM. Assay description: Agonist activity at human Gal4-PPARalpha expressed in CV1 cells by transactivation assay
In DepthDetails ArticlePubMed
TargetPeroxisome proliferator-activated receptor gamma(Homo sapiens (Human))
Eli Lilly
Curated by ChEMBL
LigandPNGBDBM50199774(3-{4-[(R)-3-(5-ethyl-biphenyl-2-yloxy)-butoxy]-2-m...)
Affinity DataIC50:  215nM. Assay description: Displacement of [3H]2-methyl-2-(4-{3-[porpyl-(5-pyridin-2yl-thiophene-2-sulfonyl)-amino]-propyl}-phenoxy)-propionic acid from human PPARgamma
In DepthDetails ArticlePubMed
TargetPeroxisome proliferator-activated receptor delta(Homo sapiens (Human))
Eli Lilly
Curated by ChEMBL
LigandPNGBDBM50199774(3-{4-[(R)-3-(5-ethyl-biphenyl-2-yloxy)-butoxy]-2-m...)
Affinity DataEC50:  6nM. Assay description: Agonist activity at human Gal4-PPARdelta expressed in CV1 cells by transactivation assay
In DepthDetails ArticlePubMed
TargetPeroxisome proliferator-activated receptor delta(Homo sapiens (Human))
Eli Lilly
Curated by ChEMBL
LigandPNGBDBM50199774(3-{4-[(R)-3-(5-ethyl-biphenyl-2-yloxy)-butoxy]-2-m...)
Affinity DataIC50:  5nM. Assay description: Displacement of [3H]2-(4-{2-[3-(2,4-difluoro-phenyl)-1-heptyl-ureido]-ethyl}-phenoxy)-2-methyl butyric acid from human PPARdelta
In DepthDetails ArticlePubMed
TargetPeroxisome proliferator-activated receptor gamma(Homo sapiens (Human))
Eli Lilly
Curated by ChEMBL
LigandPNGBDBM50199774(3-{4-[(R)-3-(5-ethyl-biphenyl-2-yloxy)-butoxy]-2-m...)
Affinity DataEC50:  836nM. Assay description: Agonist activity at PPARgamma in CV1 cells by transactivation assay
In DepthDetails ArticlePubMed