BDBM50200660 (8S,11R,13S,14R,17S)-11-(4-Dimethylamino-phenyl)-17-hydroxy-13-methyl-17-phenylethynyl-1,2,8,11,12,13,14,15,16,17-decahydro-6H-7-oxa-cyclopenta[a]phenanthren-3-one::CHEMBL390644
SMILES CN(C)c1ccc(cc1)[C@H]1C[C@@]2(C)[C@@H](CC[C@@]2(O)C#Cc2ccccc2)[C@@H]2OCC3=CC(=O)CCC3=C12
InChI Key InChIKey=UHNDECGZIZKDKD-ZDRBTZMISA-N
Data  4 IC50
  Tab Delimited (TSV)   2D SDfile   Computed 3D by Vconf -m prep SDfile
Find this compound or compounds like it in BindingDB:
Activity Spreadsheet -- Enzyme Inhibition Constant Data from BindingDB
Found 4 hits for monomerid = 50200660
TargetProgesterone receptor(Homo sapiens (Human))
Johnson And Johnson Pharmaceutical Research And Development
Curated by ChEMBL
LigandPNGBDBM50200660((8S,11R,13S,14R,17S)-11-(4-Dimethylamino-phenyl)-1...)
Affinity DataIC50:  1.40nM. Assay description: Antagonist activity at human progesterone receptor assessed as inhibition of alkaline phosphatase activity in human T47D cells
In DepthDetails ArticlePubMed
TargetProgesterone receptor(Homo sapiens (Human))
Johnson And Johnson Pharmaceutical Research And Development
Curated by ChEMBL
LigandPNGBDBM50200660((8S,11R,13S,14R,17S)-11-(4-Dimethylamino-phenyl)-1...)
Affinity DataIC50:  1.40nM. Assay description: Antagonist activity at progesterone receptor in human T47D cells assessed as inhibition of progesterone-induced alkaline phosphatase activity
In DepthDetails ArticlePubMed
TargetGlucocorticoid receptor(Homo sapiens (Human))
Johnson And Johnson Pharmaceutical Research And Development
Curated by ChEMBL
LigandPNGBDBM50200660((8S,11R,13S,14R,17S)-11-(4-Dimethylamino-phenyl)-1...)
Affinity DataIC50:  304nM. Assay description: Antagonist activity at glucocorticoid receptor in human A549 cells assessed as inhibition of corticoid-induced GRE-linked luciferase reporter gene ac...
In DepthDetails ArticlePubMed
TargetGlucocorticoid receptor(Homo sapiens (Human))
Johnson And Johnson Pharmaceutical Research And Development
Curated by ChEMBL
LigandPNGBDBM50200660((8S,11R,13S,14R,17S)-11-(4-Dimethylamino-phenyl)-1...)
Affinity DataIC50:  304nM. Assay description: Antagonist activity at human glucocorticoid receptor assessed as inhibition of corticoid-induced transcription in human A549 cells by GRE-linked luci...
In DepthDetails ArticlePubMed