BDBM50201299 7-fluoro-N,N-dimethyl-3-((2-(tetrahydro-2H-pyran-4-yl)ethylamino)methyl)-3,4-dihydro-2H-benzo[b][1,4]dioxepin-3-amine::CHEMBL392186
SMILES CN(C)C1(CNCCC2CCOCC2)COc2ccc(F)cc2OC1
InChI Key InChIKey=BOXRBFJLKOMZNE-UHFFFAOYSA-N
Data  3 KI
  Tab Delimited (TSV)   2D SDfile   Computed 3D by Vconf -m prep SDfile
Find this compound or compounds like it in BindingDB:
Activity Spreadsheet -- Enzyme Inhibition Constant Data from BindingDB
Found 3 hits for monomerid = 50201299
TargetMuscarinic acetylcholine receptor M3(Homo sapiens (Human))
Mitsubishi Pharma
Curated by ChEMBL
LigandPNGBDBM50201299(7-fluoro-N,N-dimethyl-3-((2-(tetrahydro-2H-pyran-4...)
Affinity DataKi:  4.20nM. Assay description: Displacement of 1-[N-methyl- 3H]scopolamine from human muscarinic M3 receptor expressed in Sf9 cells
In DepthDetails ArticlePubMed
TargetMuscarinic acetylcholine receptor M2(Homo sapiens (Human))
Mitsubishi Pharma
Curated by ChEMBL
LigandPNGBDBM50201299(7-fluoro-N,N-dimethyl-3-((2-(tetrahydro-2H-pyran-4...)
Affinity DataKi:  5.10nM. Assay description: Displacement of 1-[N-methyl- 3H]scopolamine from human muscarinic M2 receptor expressed in Sf9 cells
In DepthDetails ArticlePubMed
TargetMuscarinic acetylcholine receptor M1(Homo sapiens (Human))
Mitsubishi Pharma
Curated by ChEMBL
LigandPNGBDBM50201299(7-fluoro-N,N-dimethyl-3-((2-(tetrahydro-2H-pyran-4...)
Affinity DataKi:  36nM. Assay description: Displacement of 1-[N-methyl- 3H]scopolamine from human muscarinic M1 receptor expressed in Sf9 cells
In DepthDetails ArticlePubMed