BDBM50201636 CHEMBL3184132
SMILES FC(F)(F)Oc1ccc(cc1)C(=O)NCCC(=O)N[C@@H]1CCCc2ccccc12
InChI Key InChIKey=SGNRHEDBLPGDDC-GOSISDBHSA-N
Data  1 IC50
PDB links: 1 PDB ID matches this monomer.
  Tab Delimited (TSV)   2D SDfile   Computed 3D by Vconf -m prep SDfile
Find this compound or compounds like it in BindingDB:
Activity Spreadsheet -- Enzyme Inhibition Constant Data from BindingDB
Found 1 hit for monomerid = 50201636
TargetDihydroorotate dehydrogenase (quinone), mitochondrial(Homo sapiens (Human))
Broad Institute
Curated by ChEMBL
LigandPNGBDBM50201636(CHEMBL3184132)
Affinity DataIC50:  560nM. Assay description: Inhibition of human recombinant DHODH