BDBM502018 Benzyl 4-(2-((methyl- (2-(methylamino)- ethyl)amino)methyl)- 5,6-dihydro-4H- pyrrolo[1,2-b]pyrazol- 3-yl)-3,6-dihydro- pyridine-1(2H)- carboxylate::US11028083, Example 12
SMILES CNCCN(C)Cc1nn2CCCc2c1C1=CCN(CC1)C(=O)OCc1ccccc1
InChI Key InChIKey=GINOVUPHDJPTDV-UHFFFAOYSA-N
Data  1 IC50
  Tab Delimited (TSV)   2D SDfile   Computed 3D by Vconf -m prep SDfile
Find this compound or compounds like it in BindingDB:
Activity Spreadsheet -- Enzyme Inhibition Constant Data from BindingDB
Found 1 hit for monomerid = 502018
TargetProtein arginine N-methyltransferase 1(Homo sapiens)
Board Of Regents, The University Of Texas System
US Patent
LigandPNGBDBM502018(Benzyl 4-(2-((methyl- (2-(methylamino)- ethyl)amin...)
Affinity DataIC50:  151nM. Assay description: This enzymatic assay was performed in a 384 well, white, low volume plate (PerkinElmer, Catalog 6008289) with assay buffer consisting of 50 mM Hepes ...
Ligand InfoPC cidPC sid
In DepthDetails US Patent