BDBM50201865 1-(4-{5-[6-amino-5-(4-chlorophenyl)pyrimidin-4-ylethynyl]pyridin-2-yl}piperazin-1-yl)ethanone::CHEMBL225729
SMILES CC(=O)N1CCN(CC1)c1ccc(cn1)C#Cc1ncnc(N)c1-c1ccc(Cl)cc1
InChI Key InChIKey=CMQJDWHPTQPLBL-UHFFFAOYSA-N
Data  2 IC50
  Tab Delimited (TSV)   2D SDfile   Computed 3D by Vconf -m prep SDfile
Find this compound or compounds like it in BindingDB:
Activity Spreadsheet -- Enzyme Inhibition Constant Data from BindingDB
Found 2 hits for monomerid = 50201865
TargetAdenosine kinase(Homo sapiens (Human))
Abbott Laboratories
Curated by ChEMBL
LigandPNGBDBM50201865(1-(4-{5-[6-amino-5-(4-chlorophenyl)pyrimidin-4-yle...)
Affinity DataIC50:  39nM. Assay description: Inhibition of adenosine kinase in intact cells assessed as adenosine phosphorylation
In DepthDetails ArticlePubMed
TargetAdenosine kinase(Homo sapiens (Human))
Abbott Laboratories
Curated by ChEMBL
LigandPNGBDBM50201865(1-(4-{5-[6-amino-5-(4-chlorophenyl)pyrimidin-4-yle...)
Affinity DataIC50:  1nM. Assay description: Inhibition of cytosolic adenosine kinase
In DepthDetails ArticlePubMed