BDBM50202428 CHEMBL222159::N-[(1R)-1-(3'-chloro-3-fluoro-2'-propionyl-1,1'-biphenyl-4-yl)ethyl]-1-[(trifluoroacetyl)amino]cyclopropanecarboxamide
SMILES CCC(=O)c1c(Cl)cccc1-c1ccc([C@@H](C)NC(=O)C2(CC2)NC(=O)C(F)(F)F)c(F)c1
InChI Key InChIKey=FDQMNXJVXXRHAQ-GFCCVEGCSA-N
Data  1 KI
  Tab Delimited (TSV)   2D SDfile   Computed 3D by Vconf -m prep SDfile
Find this compound or compounds like it in BindingDB:
Activity Spreadsheet -- Enzyme Inhibition Constant Data from BindingDB
Found 1 hit for monomerid = 50202428
TargetB1 bradykinin receptor(Homo sapiens (Human))
Merck Research Laboratories
Curated by ChEMBL
LigandPNGBDBM50202428(CHEMBL222159 | N-[(1R)-1-(3'-chloro-3-fluoro-2'-pr...)
Affinity DataKi:  1.95nM. Assay description: Displacement of [3H]des-Arg10 Leu9 kallidin from human bradykinin B1 receptor expressed in CHO cells
In DepthDetails ArticlePubMed