BDBM50202567 1-deoxy-1-{2-chloro-6-[N'-(5-methyl-isoxazole-3-carbonyl)-hydrazino]-9H-purin-9-yl}-N-ethyl-beta-D-ribofuranuronamide::CHEMBL219155
SMILES CCNC(=O)[C@H]1O[C@H]([C@H](O)[C@@H]1O)n1cnc2c(NNC(=O)c3cc(C)on3)nc(Cl)nc12
InChI Key InChIKey=VXVSYIWPQIZMNF-QUIZZNFMSA-N
Data  3 KI  1 EC50
  Tab Delimited (TSV)   2D SDfile   Computed 3D by Vconf -m prep SDfile
Find this compound or compounds like it in BindingDB:
Activity Spreadsheet -- Enzyme Inhibition Constant Data from BindingDB
Found 4 hits for monomerid = 50202567
TargetAdenosine receptor A3(Homo sapiens (Human))
Universit£
Curated by ChEMBL
LigandPNGBDBM50202567(1-deoxy-1-{2-chloro-6-[N'-(5-methyl-isoxazole-3-ca...)
Affinity DataKi: >5.00E+3nM. Assay description: Displacement of [125I]AB-MECA from human adenosine A3 receptor expressed in CHO cells
In DepthDetails ArticlePubMed
TargetAdenosine receptor A2a(Homo sapiens (Human))
Universit£
Curated by ChEMBL
LigandPNGBDBM50202567(1-deoxy-1-{2-chloro-6-[N'-(5-methyl-isoxazole-3-ca...)
Affinity DataKi: >5.00E+3nM. Assay description: Displacement of [3H]CGS-21680 from human adenosine A2A receptor expressed in CHO cells
In DepthDetails ArticlePubMed
TargetAdenosine receptor A1(Homo sapiens (Human))
Universit£
Curated by ChEMBL
LigandPNGBDBM50202567(1-deoxy-1-{2-chloro-6-[N'-(5-methyl-isoxazole-3-ca...)
Affinity DataKi: >5.00E+3nM. Assay description: Displacement of [3H]CHA from human adenosine A1 receptor expressed in CHO cells
In DepthDetails ArticlePubMed
TargetAdenosine receptor A2b(Homo sapiens (Human))
Universit£
Curated by ChEMBL
LigandPNGBDBM50202567(1-deoxy-1-{2-chloro-6-[N'-(5-methyl-isoxazole-3-ca...)
Affinity DataEC50: >5.00E+3nM. Assay description: Activity at human adenosine A2B receptor expressed in CHO cells assessed as stimulation of cAMP levels
In DepthDetails ArticlePubMed