BDBM50203308 2-fluorobenzyl 4-[(2-pyrimidinylamino)methyl]-1-piperidinecarboxylate::CHEMBL221605
SMILES Fc1ccccc1COC(=O)N1CCC(CNc2ncccn2)CC1
InChI Key InChIKey=TXPXZBKJODPCTK-UHFFFAOYSA-N
Data  1 KI
  Tab Delimited (TSV)   2D SDfile   Computed 3D by Vconf -m prep SDfile
Find this compound or compounds like it in BindingDB:
Activity Spreadsheet -- Enzyme Inhibition Constant Data from BindingDB
Found 1 hit for monomerid = 50203308
TargetGlutamate receptor ionotropic, NMDA 2B(Homo sapiens (Human))
Merck Research Laboratories
Curated by ChEMBL
LigandPNGBDBM50203308(2-fluorobenzyl 4-[(2-pyrimidinylamino)methyl]-1-pi...)
Affinity DataKi:  18nM. Assay description: Displacement of [3H](E)-N1-(2-methoxybenzyl)cinnamamidine from human NR2B expressed in Ltk- cells
In DepthDetails ArticlePubMed