BDBM50203849 CHEMBL221904::N-{4-[1-(2-amino-acetyl)-piperidin-4-ylsulfamoyl]-naphthalen-1-yl}-2-methyl-benzamide
SMILES Cc1ccccc1C(=O)Nc1ccc(c2ccccc12)S(=O)(=O)NC1CCN(CC1)C(=O)CN
InChI Key InChIKey=UJTIDXNZRJUKLM-UHFFFAOYSA-N
Data  1 KI
  Tab Delimited (TSV)   2D SDfile   Computed 3D by Vconf -m prep SDfile
Find this compound or compounds like it in BindingDB:
Activity Spreadsheet -- Enzyme Inhibition Constant Data from BindingDB
Found 1 hit for monomerid = 50203849
TargetC-C chemokine receptor type 8(Homo sapiens (Human))
Millennium Pharmaceuticals
Curated by ChEMBL
LigandPNGBDBM50203849(CHEMBL221904 | N-{4-[1-(2-amino-acetyl)-piperidin-...)
Affinity DataKi:  4.10nM. Assay description: Binding affinity to human CCR8 expressed in L1.2 cells by FMAT assay
In DepthDetails ArticlePubMed