BDBM502041 N1-((3-(4,4-bis- (methoxymethyl)- cyclohexyl)-4,5,6,7- tetrahydropyrazolo- [1,5-a]pyridin-2-yl)- methyl)-N1,N2- dimethylethane-1,2- diamine::US11028083, Example 35
SMILES CNCCN(C)Cc1nn2CCCCc2c1C1CCC(COC)(COC)CC1
InChI Key InChIKey=TYKREABPSYAEQH-UHFFFAOYSA-N
Data  1 IC50
  Tab Delimited (TSV)   2D SDfile   Computed 3D by Vconf -m prep SDfile
Find this compound or compounds like it in BindingDB:
Activity Spreadsheet -- Enzyme Inhibition Constant Data from BindingDB
Found 1 hit for monomerid = 502041
TargetProtein arginine N-methyltransferase 1(Homo sapiens)
Board Of Regents, The University Of Texas System
US Patent
LigandPNGBDBM502041(N1-((3-(4,4-bis- (methoxymethyl)- cyclohexyl)-4,5,...)
Affinity DataIC50:  172nM. Assay description: This enzymatic assay was performed in a 384 well, white, low volume plate (PerkinElmer, Catalog 6008289) with assay buffer consisting of 50 mM Hepes ...
Ligand InfoPC cidPC sid
In DepthDetails US Patent