BDBM502050 N1-((3-(4-methoxy-4- methylcyclohexyl)-5,6- dihydro-4H-pyrrolo- [1,2-b]pyrazol-2- yl)methyl)-N1,N2- dimethylethane-1,2- diamine::US11028083, Example 44
SMILES CNCCN(C)Cc1nn2CCCc2c1C1CCC(C)(CC1)OC
InChI Key InChIKey=ZMRSVWPABVSYFW-UHFFFAOYSA-N
Data  1 IC50
  Tab Delimited (TSV)   2D SDfile   Computed 3D by Vconf -m prep SDfile
Find this compound or compounds like it in BindingDB:
Activity Spreadsheet -- Enzyme Inhibition Constant Data from BindingDB
Found 1 hit for monomerid = 502050
TargetProtein arginine N-methyltransferase 1(Homo sapiens)
Board Of Regents, The University Of Texas System
US Patent
LigandPNGBDBM502050(N1-((3-(4-methoxy-4- methylcyclohexyl)-5,6- dihydr...)
Affinity DataIC50:  99nM. Assay description: This enzymatic assay was performed in a 384 well, white, low volume plate (PerkinElmer, Catalog 6008289) with assay buffer consisting of 50 mM Hepes ...
Ligand InfoPC cidPC sid
In DepthDetails US Patent