BDBM50205463 7-((R)-3-((S)-1-(2-cyanoethylamino)ethyl)pyrrolidin-1-yl)-1-cyclopropyl-6-fluoro-8-methoxy-4-oxo-1,4-dihydroquinoline-3-carboxylic acid::CHEMBL390003
SMILES COc1c(N2CC[C@H](C2)[C@H](C)NCCC#N)c(F)cc2c1n(cc(C(O)=O)c2=O)C1CC1
InChI Key InChIKey=QIOWXXXKNBGPEJ-UONOGXRCSA-N
Data  1 KI
  Tab Delimited (TSV)   2D SDfile   Computed 3D by Vconf -m prep SDfile
Find this compound or compounds like it in BindingDB:
Activity Spreadsheet -- Enzyme Inhibition Constant Data from BindingDB
Found 1 hit for monomerid = 50205463
TargetPotassium voltage-gated channel subfamily H member 2(Homo sapiens (Human))
Pfizer
Curated by ChEMBL
LigandPNGBDBM50205463(7-((R)-3-((S)-1-(2-cyanoethylamino)ethyl)pyrrolidi...)
Affinity DataKi: >1.50E+5nM. Assay description: Displacement of [3H]dofetilide from human ERG by fliter binding assay
In DepthDetails ArticlePubMed