BDBM50205786 (E)-2-(4-fluorostyryl)-5-(phenylsulfonyl)pyridine::CHEMBL394729
SMILES Fc1ccc(\C=C\c2ccc(cn2)S(=O)(=O)c2ccccc2)cc1
InChI Key InChIKey=ANNXZFGXMGNRDN-DHZHZOJOSA-N
Data  4 KI
  Tab Delimited (TSV)   2D SDfile   Computed 3D by Vconf -m prep SDfile
Find this compound or compounds like it in BindingDB:
Activity Spreadsheet -- Enzyme Inhibition Constant Data from BindingDB
Found 4 hits for monomerid = 50205786
Target5-hydroxytryptamine receptor 2A(Homo sapiens (Human))
Merck Sharp And Dohme Research Laboratories
Curated by ChEMBL
LigandPNGBDBM50205786((E)-2-(4-fluorostyryl)-5-(phenylsulfonyl)pyridine ...)
Affinity DataKi:  7.40nM. Assay description: Displacement of [3H]ketanserin from human 5HT2A receptor expressed in CHO cells
In DepthDetails ArticlePubMed
TargetD(2) dopamine receptor(Homo sapiens (Human))
Merck Sharp And Dohme Research Laboratories
Curated by ChEMBL
LigandPNGBDBM50205786((E)-2-(4-fluorostyryl)-5-(phenylsulfonyl)pyridine ...)
Affinity DataKi: >1.00E+3nM. Assay description: Displacement of [3H]spiperone from human dopamine D2 receptor expressed in CHO cells
In DepthDetails ArticlePubMed
Target5-hydroxytryptamine receptor 2C(Homo sapiens (Human))
Merck Sharp And Dohme Research Laboratories
Curated by ChEMBL
LigandPNGBDBM50205786((E)-2-(4-fluorostyryl)-5-(phenylsulfonyl)pyridine ...)
Affinity DataKi: >4.00E+3nM. Assay description: Displacement of [3H]mesurgeline from human 5HT2C receptor expressed in CHO cells
In DepthDetails ArticlePubMed
TargetPotassium voltage-gated channel subfamily H member 2(Homo sapiens (Human))
Merck Sharp And Dohme Research Laboratories
Curated by ChEMBL
LigandPNGBDBM50205786((E)-2-(4-fluorostyryl)-5-(phenylsulfonyl)pyridine ...)
Affinity DataKi: >9.00E+3nM. Assay description: Displacement of [3H]dofetilide from hERG expressed in HEK cells
In DepthDetails ArticlePubMed