BDBM50205799 (E)-2-(2-(5-(2-fluorophenylsulfonyl)pyridin-2-yl)vinyl)phenol::CHEMBL240877
SMILES Oc1ccccc1\C=C\c1ccc(cn1)S(=O)(=O)c1ccccc1F
InChI Key InChIKey=YNXMRPPJUWZMOJ-MDZDMXLPSA-N
Data  4 KI
  Tab Delimited (TSV)   2D SDfile   Computed 3D by Vconf -m prep SDfile
Find this compound or compounds like it in BindingDB:
Activity Spreadsheet -- Enzyme Inhibition Constant Data from BindingDB
Found 4 hits for monomerid = 50205799
Target5-hydroxytryptamine receptor 2A(Homo sapiens (Human))
Merck Sharp And Dohme Research Laboratories
Curated by ChEMBL
LigandPNGBDBM50205799((E)-2-(2-(5-(2-fluorophenylsulfonyl)pyridin-2-yl)v...)
Affinity DataKi:  3.60nM. Assay description: Displacement of [3H]ketanserin from human 5HT2A receptor expressed in CHO cells
In DepthDetails ArticlePubMed
Target5-hydroxytryptamine receptor 2C(Homo sapiens (Human))
Merck Sharp And Dohme Research Laboratories
Curated by ChEMBL
LigandPNGBDBM50205799((E)-2-(2-(5-(2-fluorophenylsulfonyl)pyridin-2-yl)v...)
Affinity DataKi:  810nM. Assay description: Displacement of [3H]mesurgeline from human 5HT2C receptor expressed in CHO cells
In DepthDetails ArticlePubMed
TargetPotassium voltage-gated channel subfamily H member 2(Homo sapiens (Human))
Merck Sharp And Dohme Research Laboratories
Curated by ChEMBL
LigandPNGBDBM50205799((E)-2-(2-(5-(2-fluorophenylsulfonyl)pyridin-2-yl)v...)
Affinity DataKi:  1.40E+3nM. Assay description: Displacement of [3H]dofetilide from hERG expressed in HEK cells
In DepthDetails ArticlePubMed
TargetD(2) dopamine receptor(Homo sapiens (Human))
Merck Sharp And Dohme Research Laboratories
Curated by ChEMBL
LigandPNGBDBM50205799((E)-2-(2-(5-(2-fluorophenylsulfonyl)pyridin-2-yl)v...)
Affinity DataKi: >2.00E+3nM. Assay description: Displacement of [3H]spiperone from human dopamine D2 receptor expressed in CHO cells
In DepthDetails ArticlePubMed