BDBM502060 N-(3-(2-((methyl(2- (methylamino)ethyl)- amino)methyl)-5,6- dihydro-4H-pyrrolo- [1,2-b]pyrazol-3-yl)- cyclopentyl)- propionamide::US11028083, Example 54
SMILES CCC(=O)NC1CCC(C1)c1c(CN(C)CCNC)nn2CCCc12
InChI Key InChIKey=PJFZAWXZHPBCIV-UHFFFAOYSA-N
Data  1 IC50
  Tab Delimited (TSV)   2D SDfile   Computed 3D by Vconf -m prep SDfile
Find this compound or compounds like it in BindingDB:
Activity Spreadsheet -- Enzyme Inhibition Constant Data from BindingDB
Found 1 hit for monomerid = 502060
TargetProtein arginine N-methyltransferase 1(Homo sapiens)
Board Of Regents, The University Of Texas System
US Patent
LigandPNGBDBM502060(N-(3-(2-((methyl(2- (methylamino)ethyl)- amino)met...)
Affinity DataIC50:  398nM. Assay description: This enzymatic assay was performed in a 384 well, white, low volume plate (PerkinElmer, Catalog 6008289) with assay buffer consisting of 50 mM Hepes ...
Ligand InfoPC cidPC sid
In DepthDetails US Patent